BDBM50559543 CHEMBL4754086
SMILES Cn1cc2cc(ccc2n1)-n1nc2ccc(OCC(F)F)nc2c(-c2ccc(OC(F)F)cc2)c1=O
InChI Key InChIKey=INTOGIZNZMXCPU-UHFFFAOYSA-N
Data  2 IC50
  Tab Delimited (TSV)   2D SDfile   Computed 3D by Vconf -m prep SDfile
Find this compound or compounds like it in BindingDB:
Activity Spreadsheet -- Enzyme Inhibition Constant Data from BindingDB
Found 2 hits for monomerid = 50559543
TargetS-adenosylmethionine synthase isoform type-2(Human)
Usona Institute
Curated by ChEMBL
LigandPNGBDBM50559543(CHEMBL4754086)
Affinity DataIC50: <100nM. Assay description: Inhibition of MAT2A in human HCT-116 cells assessed as reduction in SAM incubated for 72 hrs by LC-MS/MS analysis
Ligand InfoPC cidPC sid
In DepthDetails ArticlePubMed
TargetS-adenosylmethionine synthase isoform type-2(Human)
Usona Institute
Curated by ChEMBL
LigandPNGBDBM50559543(CHEMBL4754086)
Affinity DataIC50: <100nM. Assay description: Inhibition of recombinant human MAT2A expressed in baculovirus infected Sf9 cells using L-methionine as substrate incubated for 60 mins followed by s...
Ligand InfoPC cidPC sid
In DepthDetails ArticlePubMed